{"text_format":"1","workbook":"xlsx","n_sheets":2,"sheets":["変更報告書","選択肢"],"not_rendered":{"charts":0,"images":0,"macros":0,"external_links":0,"defined_names":15,"comments":1,"pivot_tables":0},"unopened":[],"bounds":{"document_bytes":16777216,"sheet_cells":100000,"rows_first":2000,"rows_last":500,"rows_between":2000,"halvings":0,"cell_chars":16384,"cell_head_chars":4096},"cells_cut":0,"cells_raw":0,"read":"whole","date_system":"1900"}

{"sheet":"変更報告書","index":0,"n_rows":30,"n_cols":14,"rows_kept":30,"cut":false,"hidden":false,"merged":[[9,0,17,1],[18,0,23,1],[24,0,28,1],[27,2,27,6],[28,2,28,6],[20,7,20,14],[22,2,22,6],[24,2,24,6],[25,2,25,6],[21,3,21,6],[21,7,21,14],[19,2,21,2],[19,3,19,6],[19,7,19,9],[20,3,20,6],[22,7,22,11],[1,0,1,6],[1,7,1,9],[1,10,1,11],[27,7,27,9],[16,2,16,6],[17,2,17,6],[18,2,18,6],[10,7,10,9],[12,7,12,14],[8,7,8,9],[14,2,14,6],[14,7,14,14],[15,2,15,6],[15,7,15,14],[16,7,16,11],[26,2,26,6],[29,0,30,0],[29,1,30,14],[23,2,23,6],[24,7,24,9],[25,7,25,9],[26,7,26,9],[28,7,28,9],[23,7,23,11],[17,7,17,11],[9,2,9,6],[13,2,13,6],[13,7,13,14],[10,2,12,2],[10,3,10,6],[2,12,2,13],[11,3,11,6],[11,7,11,14],[12,3,12,6],[2,0,8,1],[2,2,2,6],[3,2,3,6],[3,12,3,13],[4,2,4,6],[5,2,5,6],[2,7,2,11],[3,7,3,11],[5,7,5,12],[6,2,6,6],[7,2,7,6],[8,2,8,6]]}
["入会申込書"]
["会員番号",null,null,null,null,null,null,null,null,null,"都道府県薬",null,"岩手県","地域"]
["会員",null,"氏名（必須）",null,null,null,null,null,null,null,null,null,"氏名変更"]
[null,null,"フリガナ（同姓同名区別の為必須）",null,null,null,null,null,null,null,null,null,"性別"]
[null,null,"生年月日（同姓同名区別の為必須）",null,null,null,null,null,null,"年",null,"月",null,"日"]
[null,null,"出身校名\n（大学院、選科、専攻科等は入力できません）"]
[null,null,"卒業年月",null,null,null,null,null,null,"年",null,"月"]
[null,null,"薬剤師免許取得年月",null,null,null,null,null,null,"年",null,"月"]
[null,null,"薬剤師番号（同姓同名区別の為必須）"]
["勤務先",null,"郵便番号",null,null,null,null,null,"－",null,{"$f":"IF(OR($H$10=\"\",$J$10=\"\"),\"\",$H$10&$J$10)","v":""}]
[null,null,"所在地","（都道府県）",null,null,null,null,null,null,{"$f":"IFERROR(VLOOKUP($K$10,#REF!,6,FALSE),\"\")","v":""},{"$f":"IFERROR(VLOOKUP($K$10,#REF!,2,FALSE),\"\")","v":""}]
[null,null,null,"（区市町村以降・丁目・地番・号数）"]
[null,null,null,"（建物号室）"]
[null,null,"勤務先名称"]
[null,null,"法人の名称"]
[null,null,"開設者・法人代表者の氏名"]
[null,null,"電話番号"]
[null,null,"FAX番号"]
["自宅",null,"郵便番号",null,null,null,null,null,"－",null,{"$f":"IF(OR($H$19=\"\",$J$19=\"\"),\"\",$H$19&$J$19)","v":""}]
[null,null,"所在地","（都道府県）",null,null,null,null,null,null,{"$f":"IFERROR(VLOOKUP($K$19,#REF!,6,FALSE),\"\")","v":""},{"$f":"IFERROR(VLOOKUP($K$19,#REF!,2,FALSE),\"\")","v":""}]
[null,null,null,"（区市町村以降・丁目・地番・号数）"]
[null,null,null,"（建物号室）"]
[null,null,"電話番号"]
[null,null,"FAX番号"]
["区分等",null,"雑誌発送先"]
[null,null,"勤務先業態"]
[null,null,"業務種別"]
[null,null,"薬剤師区分"]
[null,null,"学校薬剤師区分"]
["備考"]

{"sheet":"選択肢","index":1,"n_rows":124,"n_cols":37,"rows_kept":124,"cut":false,"hidden":true,"merged":[]}
["都道府県番号","都道府県名",null,"支部ＣＤ","支部",null,"雑誌発送先区分","雑誌発送先",null,"勤務先業態区分","勤務先業態",null,"業務種別区分","業務種別",null,"管理薬剤師区分","管理薬剤師区分",null,"学校薬剤師区分","学校薬剤師",null,"氏名変更区分",null,"元号",null,"性別",null,"年",null,"月",null,"日",null,"日薬大学コード","略　記","薬科大学名","大学名カナ"]
["01","北海道",null,"01","盛岡",null,"A","勤務先",null,"Ａ","保険薬局",null,"Ａ","開設者(日薬正会員)",null,"Ａ","管理薬剤師",null,"Ａ","学校薬剤師",null,"有",null,"大正",null,"男",null,1,null,1,null,1,null,"093","愛知学院","愛知学院大学薬学部（H21.3卒～）","ｱｲﾁｶﾞｸｲﾝﾀﾞｲｶﾞｸﾔｸｶﾞｸﾌﾞ"]
["02","青森県",null,"02","花巻",null,"B","自宅",null,"Ｂ","非保険薬局",null,"Ｂ","病診薬局長",null,"Ｂ","その他の薬剤師",null,"Ｂ","非学校薬剤師",null,null,null,"昭和",null,"女",null,2,null,2,null,2,null,"040","名薬専","愛知薬学校","ｱｲﾁﾔｸｶﾞｸｺｳ"]
["03","岩手県",null,"03","北上",null,null,null,null,"Ｃ","病診薬局",null,"Ｃ","法人代表者(日薬賛助会員)",null,null,null,null,null,null,null,null,null,"平成",null,null,null,3,null,3,null,3,null,"081","青森大","青森大学薬学部（H20.3卒～）","ｱｵﾓﾘﾀﾞｲｶﾞｸﾔｸｶﾞｸﾌﾞ"]
["04","宮城県",null,"04","奥州",null,null,null,null,"Ｄ","臨床検査",null,"Ｄ","その他",null,null,null,null,null,null,null,null,null,"令和",null,null,null,4,null,4,null,4,null,"103","いわき","いわき明星大学薬学部（H25.3卒～R01.3卒）","ｲﾜｷﾒｲｾｲﾀﾞｲｶﾞｸﾔｸｶﾞｸﾌﾞ"]
["05","秋田県",null,"05","一関",null,null,null,null,"Ｅ","教育・研究",null,null,null,null,null,null,null,null,null,null,null,null,null,null,null,null,5,null,5,null,5,null,"111","医療創生","医療創生大学薬学部（R02.3卒～）","ｲﾘｮｳｿｳｾｲﾀﾞｲｶﾞｸﾔｸｶﾞｸﾌﾞ"]
["06","山形県",null,"06","気仙",null,null,null,null,"Ｆ","行政",null,null,null,null,null,null,null,null,null,null,null,null,null,null,null,null,6,null,6,null,6,null,"102","岩手医科","岩手医科大学薬学部（H25.3卒～）","ｲﾜﾃｲｶﾀﾞｲｶﾞｸﾔｸｶﾞｸﾌﾞ"]
["07","福島県",null,"08","釜石",null,null,null,null,"Ｇ","製薬・輸入",null,null,null,null,null,null,null,null,null,null,null,null,null,null,null,null,7,null,7,null,7,null,"090","奥羽大","奥羽大学薬学部（H21.3卒～）","ｵｳｳﾀﾞｲｶﾞｸﾔｸｶﾞｸﾌﾞ"]
["08","茨城県",null,"09","宮古",null,null,null,null,"Ｉ","卸売販売業",null,null,null,null,null,null,null,null,null,null,null,null,null,null,null,null,8,null,8,null,8,null,"112","大阪医薬","大阪医科薬科大学薬学部（R04.3卒～）","ｵｵｻｶｲｶﾔｯｶﾀﾞｲｶﾞｸﾔｸｶﾞｸﾌﾞ"]
["09","栃木県",null,"10","久慈",null,null,null,null,"Ｋ","店舗販売業",null,null,null,null,null,null,null,null,null,null,null,null,null,null,null,null,9,null,9,null,9,null,"049","阪　大","大阪大学医学部薬学科","ｵｵｻｶﾀﾞｲｶﾞｸｲｶﾞｸﾌﾞﾔｸｶﾞｸｶ"]
["10","群馬県",null,"11","二戸",null,null,null,null,"Ｌ","その他",null,null,null,null,null,null,null,null,null,null,null,null,null,null,null,null,10,null,10,null,10,null,"075","阪附薬専","大阪大学付属薬学専門部","ｵｵｻｶﾀﾞｲｶﾞｸﾌｿﾞｸﾔｸｶﾞｸｾﾝﾓﾝﾌﾞ"]
["11","埼玉県",null,null,null,null,null,null,null,"Ｍ","無職",null,null,null,null,null,null,null,null,null,null,null,null,null,null,null,null,11,null,11,null,11,null,"049","阪　大","大阪大学薬学部","ｵｵｻｶﾀﾞｲｶﾞｸﾔｸｶﾞｸﾌﾞ"]
["12","千葉県",null,null,null,null,null,null,null,null,null,null,null,null,null,null,null,null,null,null,null,null,null,null,null,null,null,12,null,12,null,12,null,"076","道修薬","大阪道修薬学校","ｵｵｻｶﾄﾞｳｼｭｳﾔｸｶﾞｸｺｳ"]
["13","東京都",null,null,null,null,null,null,null,null,null,null,null,null,null,null,null,null,null,null,null,null,null,null,null,null,null,13,null,null,null,13,null,"048","大阪薬専","大阪薬学専門学校","ｵｵｻｶﾔｸｶﾞｸｾﾝﾓﾝｶﾞｯｺｳ"]
["14","神奈川県",null,null,null,null,null,null,null,null,null,null,null,null,null,null,null,null,null,null,null,null,null,null,null,null,null,14,null,null,null,14,null,"051","大阪薬大","大阪薬科大学","ｵｵｻｶﾔｯｶﾀﾞｲｶﾞｸ"]
["15","新潟県",null,null,null,null,null,null,null,null,null,null,null,null,null,null,null,null,null,null,null,null,null,null,null,null,null,15,null,null,null,15,null,"057","岡山大","岡山大学薬学部（医学部薬学科）","ｵｶﾔﾏﾀﾞｲｶﾞｸﾔｸｶﾞｸﾌﾞ"]
["16","富山県",null,null,null,null,null,null,null,null,null,null,null,null,null,null,null,null,null,null,null,null,null,null,null,null,null,16,null,null,null,16,null,"098","大阪大谷","大阪大谷大学薬学部（H24.3卒～）","ｵｻｶｵｵﾀﾆﾀﾞｲｶﾞｸﾔｸｶﾞｸﾌﾞ"]
["17","石川県",null,null,null,null,null,null,null,null,null,null,null,null,null,null,null,null,null,null,null,null,null,null,null,null,null,17,null,null,null,17,null,"037","金沢薬専","金沢医大薬学専門部","ｶﾅｻﾞﾜｲﾀﾞｲﾔｸｶﾞｸｾﾝﾓﾝﾌﾞ"]
["18","福井県",null,null,null,null,null,null,null,null,null,null,null,null,null,null,null,null,null,null,null,null,null,null,null,null,null,18,null,null,null,18,null,"038","金沢大","金沢大学薬学部","ｶﾅｻﾞﾜﾀﾞｲｶﾞｸﾔｸｶﾞｸﾌﾞ"]
["19","山梨県",null,null,null,null,null,null,null,null,null,null,null,null,null,null,null,null,null,null,null,null,null,null,null,null,null,19,null,null,null,19,null,"071","関　学","関西学院専門学校製薬工業科","ｶﾝｾｲｶﾞｸｲﾝｾﾝﾓﾝｶﾞｯｺｳｾｲﾔｸｺｳｷﾞｮｳｶ"]
["20","長野県",null,null,null,null,null,null,null,null,null,null,null,null,null,null,null,null,null,null,null,null,null,null,null,null,null,20,null,null,null,20,null,"028","北里大","北里大学薬学部","ｷﾀｻﾄﾀﾞｲｶﾞｸﾔｸｶﾞｸﾌﾞ"]
["21","岐阜県",null,null,null,null,null,null,null,null,null,null,null,null,null,null,null,null,null,null,null,null,null,null,null,null,null,21,null,null,null,21,null,"116","岐阜医療","岐阜医療科学大学薬学部（R08.3卒～）","ｷﾞﾌｲﾘｮｳｶｶﾞｸﾀﾞｲｶﾞｸﾔｸｶﾞｸﾌﾞ"]
["22","静岡県",null,null,null,null,null,null,null,null,null,null,null,null,null,null,null,null,null,null,null,null,null,null,null,null,null,22,null,null,null,22,null,"043","岐阜薬専","岐阜薬学専門学校","ｷﾞﾌﾔｸｶﾞｸｾﾝﾓﾝｶﾞｯｺｳ"]
["23","愛知県",null,null,null,null,null,null,null,null,null,null,null,null,null,null,null,null,null,null,null,null,null,null,null,null,null,23,null,null,null,23,null,"044","岐阜薬大","岐阜薬科大学","ｷﾞﾌﾔｯｶﾀﾞｲｶﾞｸ"]
["24","三重県",null,null,null,null,null,null,null,null,null,null,null,null,null,null,null,null,null,null,null,null,null,null,null,null,null,24,null,null,null,24,null,"117","九医科大","九州医療科学大学薬学部（R07.3卒～）","ｷｭｳｼｭｳｲﾘｮｳｶｶﾞｸﾀﾞｲｶﾞｸﾔｸｶﾞｸﾌﾞ"]
["25","滋賀県",null,null,null,null,null,null,null,null,null,null,null,null,null,null,null,null,null,null,null,null,null,null,null,null,null,25,null,null,null,25,null,"063","九　大","九州大学医学部薬学科","ｷｭｳｼｭｳﾀﾞｲｶﾞｸｲｶﾞｸﾌﾞﾔｸｶﾞｸｶ"]
["26","京都府",null,null,null,null,null,null,null,null,null,null,null,null,null,null,null,null,null,null,null,null,null,null,null,null,null,26,null,null,null,26,null,"063","九　大","九州大学薬学部","ｷｭｳｼｭｳﾀﾞｲｶﾞｸﾔｸｶﾞｸﾌﾞ"]
["27","大阪府",null,null,null,null,null,null,null,null,null,null,null,null,null,null,null,null,null,null,null,null,null,null,null,null,null,27,null,null,null,27,null,"080","九保福大","九州保健福祉大学薬学部（H19.3卒～）","ｷｭｳｼｭｳﾎｹﾝﾌｸｼﾀﾞｲｶﾞｸﾔｸｶﾞｸﾌﾞ"]
["28","兵庫県",null,null,null,null,null,null,null,null,null,null,null,null,null,null,null,null,null,null,null,null,null,null,null,null,null,28,null,null,null,28,null,"065","熊本薬専","九州薬学専門学校","ｷｭｼｭｳﾔｸｶﾞｸｾﾝﾓﾝｶﾞｯｺｳ"]
["29","奈良県",null,null,null,null,null,null,null,null,null,null,null,null,null,null,null,null,null,null,null,null,null,null,null,null,null,29,null,null,null,29,null,"069","京城薬専","京城薬学専門学校","ｷｮｳｼﾞｮｳﾔｸｶﾞｸｾﾝﾓﾝｶﾞｯｺｳ"]
["30","和歌山県",null,null,null,null,null,null,null,null,null,null,null,null,null,null,null,null,null,null,null,null,null,null,null,null,null,30,null,null,null,30,null,"047","京　大","京都大学医学部薬学科","ｷｮｳﾄﾀﾞｲｶﾞｸｲｶﾞｸﾌﾞﾔｸｶﾞｸｶ"]
["31","鳥取県",null,null,null,null,null,null,null,null,null,null,null,null,null,null,null,null,null,null,null,null,null,null,null,null,null,31,null,null,null,31,null,"047","京　大","京都大学薬学部","ｷｮｳﾄﾀﾞｲｶﾞｸﾔｸｶﾞｸﾌﾞ"]
["32","島根県",null,null,null,null,null,null,null,null,null,null,null,null,null,null,null,null,null,null,null,null,null,null,null,null,null,32,null,null,null,null,null,"045","京都薬専","京都薬学専門学校","ｷｮｳﾄﾔｸｶﾞｸｾﾝﾓﾝｶﾞｯｺｳ"]
["33","岡山県",null,null,null,null,null,null,null,null,null,null,null,null,null,null,null,null,null,null,null,null,null,null,null,null,null,33,null,null,null,null,null,"046","京都薬大","京都薬科大学","ｷｮｳﾄﾔｯｶﾀﾞｲｶﾞｸ"]
["34","広島県",null,null,null,null,null,null,null,null,null,null,null,null,null,null,null,null,null,null,null,null,null,null,null,null,null,34,null,null,null,null,null,"026","共立薬専","共立女子薬学専門学校","ｷｮｳﾘﾂｼﾞｮｼﾔｸｶﾞｸｾﾝﾓﾝｶﾞｯｺｳ"]
["35","山口県",null,null,null,null,null,null,null,null,null,null,null,null,null,null,null,null,null,null,null,null,null,null,null,null,null,35,null,null,null,null,null,"027","共立薬大","共立薬科大学","ｷｮｳﾘﾂﾔｯｶﾀﾞｲｶﾞｸ"]
["36","徳島県",null,null,null,null,null,null,null,null,null,null,null,null,null,null,null,null,null,null,null,null,null,null,null,null,null,36,null,null,null,null,null,"052","近畿大","近畿大学薬学部","ｷﾝｷﾀﾞｲｶﾞｸﾔｸｶﾞｸﾌﾞ"]
["37","香川県",null,null,null,null,null,null,null,null,null,null,null,null,null,null,null,null,null,null,null,null,null,null,null,null,null,37,null,null,null,null,null,"092","金城学院","金城学院大学薬学部（H21.3卒～）","ｷﾝｼﾞｮｳｶﾞｸｲﾝﾀﾞｲｶﾞｸﾔｸｶﾞｸﾌﾞ"]
["38","愛媛県",null,null,null,null,null,null,null,null,null,null,null,null,null,null,null,null,null,null,null,null,null,null,null,null,null,38,null,null,null,null,null,"066","熊本大","熊本大学薬学部","ｸﾏﾓﾄﾀﾞｲｶﾞｸﾔｸｶﾞｸﾌﾞ"]
["39","高知県",null,null,null,null,null,null,null,null,null,null,null,null,null,null,null,null,null,null,null,null,null,null,null,null,null,39,null,null,null,null,null,"065","熊本薬専","熊本薬学専門学校","ｸﾏﾓﾄﾔｸｶﾞｸｾﾝﾓﾝｶﾞｯｺｳ"]
["40","福岡県",null,null,null,null,null,null,null,null,null,null,null,null,null,null,null,null,null,null,null,null,null,null,null,null,null,40,null,null,null,null,null,"089","慶應義塾","慶應義塾大学薬学部（H21.3卒～）","ｹｲｵｳｷﾞｼﾞｭｸﾀﾞｲｶﾞｸﾔｸｶﾞｸﾌﾞ"]
["41","佐賀県",null,null,null,null,null,null,null,null,null,null,null,null,null,null,null,null,null,null,null,null,null,null,null,null,null,41,null,null,null,null,null,"056","神戸学院","神戸学院大学薬学部","ｺｳﾍﾞｶﾞｸｲﾝﾀﾞｲｶﾞｸﾔｸｶﾞｸﾌﾞ"]
["42","長崎県",null,null,null,null,null,null,null,null,null,null,null,null,null,null,null,null,null,null,null,null,null,null,null,null,null,42,null,null,null,null,null,"054","神戸薬専","神戸女子薬学専門学校","ｺｳﾍﾞｼﾞｮｼﾔｸｶﾞｸｾﾝﾓﾝｶﾞｯｺｳ"]
["43","熊本県",null,null,null,null,null,null,null,null,null,null,null,null,null,null,null,null,null,null,null,null,null,null,null,null,null,43,null,null,null,null,null,"055","神女薬大","神戸女子薬科大学","ｺｳﾍﾞｼﾞｮｼﾔｯｶﾀﾞｲｶﾞｸ"]
["44","大分県",null,null,null,null,null,null,null,null,null,null,null,null,null,null,null,null,null,null,null,null,null,null,null,null,null,44,null,null,null,null,null,"078","神戸薬大","神戸薬科大学（旧神女薬大　H6.4～）","ｺｳﾍﾞﾔｯｶﾀﾞｲｶﾞｸ"]
["45","宮崎県",null,null,null,null,null,null,null,null,null,null,null,null,null,null,null,null,null,null,null,null,null,null,null,null,null,45,null,null,null,null,null,"091","国際医療","国際医療福祉大学薬学部（H21.3卒～）","ｺｸｻｲｲﾘｮｳﾌｸｼﾀﾞｲｶﾞｸﾔｸｶﾞｸﾌﾞ"]
["46","鹿児島県",null,null,null,null,null,null,null,null,null,null,null,null,null,null,null,null,null,null,null,null,null,null,null,null,null,46,null,null,null,null,null,"033","静岡県立","静岡県立大学薬学部（S62.4～）","ｼｽﾞｵｶｹﾝﾘﾂﾀﾞｲｶﾞｸﾔｸｶﾞｸﾌﾞ"]
["47","沖縄県",null,null,null,null,null,null,null,null,null,null,null,null,null,null,null,null,null,null,null,null,null,null,null,null,null,47,null,null,null,null,null,"032","静女薬専","静岡女子薬学専門学校","ｼｽﾞｵｶｼﾞｮｼﾔｸｶﾞｸｾﾝﾓﾝｶﾞｯｺｳ"]
[null,null,null,null,null,null,null,null,null,null,null,null,null,null,null,null,null,null,null,null,null,null,null,null,null,null,null,48,null,null,null,null,null,"099","静薬大","静岡薬科大学（S62.3まで）","ｼｽﾞｵｶﾔｯｶﾀﾞｲｶﾞｸ"]
[null,null,null,null,null,null,null,null,null,null,null,null,null,null,null,null,null,null,null,null,null,null,null,null,null,null,null,49,null,null,null,null,null,"079","就実大","就実大学薬学部（H19.3卒～）","ｼｭｳｼﾞﾂﾀﾞｲｶﾞｸﾔｸｶﾞｸﾌﾞ"]
[null,null,null,null,null,null,null,null,null,null,null,null,null,null,null,null,null,null,null,null,null,null,null,null,null,null,null,50,null,null,null,null,null,"084","城西国際","城西国際大学薬学部（H20.卒～）","ｼﾞｮｳｻｲｺｸｻｲﾀﾞｲｶﾞｸﾔｸｶﾞｸﾌﾞ"]
[null,null,null,null,null,null,null,null,null,null,null,null,null,null,null,null,null,null,null,null,null,null,null,null,null,null,null,52,null,null,null,null,null,"029","城西大","城西大学薬学部","ｼﾞｮｳｻｲﾀﾞｲｶﾞｸﾔｸｶﾞｸﾌﾞ"]
[null,null,null,null,null,null,null,null,null,null,null,null,null,null,null,null,null,null,null,null,null,null,null,null,null,null,null,53,null,null,null,null,null,"024","昭和薬専","昭和女子薬学専門学校","ｼｮｳﾜｼﾞｮｼﾔｸｶﾞｸｾﾝﾓﾝｶﾞｯｺｳ"]
[null,null,null,null,null,null,null,null,null,null,null,null,null,null,null,null,null,null,null,null,null,null,null,null,null,null,null,51,null,null,null,null,null,"023","昭和大","昭和大学薬学部","ｼｮｳﾜﾀﾞｲｶﾞｸﾔｸｶﾞｸﾌﾞ"]
[null,null,null,null,null,null,null,null,null,null,null,null,null,null,null,null,null,null,null,null,null,null,null,null,null,null,null,54,null,null,null,null,null,"115","昭和医大","昭和医科大学薬学部（旧昭和大　R7.4～）","ｼｮｳﾜｲｶﾀﾞｲｶﾞｸﾔｸｶﾞｸﾌﾞ"]
[null,null,null,null,null,null,null,null,null,null,null,null,null,null,null,null,null,null,null,null,null,null,null,null,null,null,null,55,null,null,null,null,null,"025","昭和薬大","昭和薬科大学","ｼｮｳﾜﾔｯｶﾀﾞｲｶﾞｸ"]
[null,null,null,null,null,null,null,null,null,null,null,null,null,null,null,null,null,null,null,null,null,null,null,null,null,null,null,56,null,null,null,null,null,"072","新京医大","新京医大薬学部","ｼﾝｷｮｳｲﾀﾞｲﾔｸｶﾞｸﾌﾞ"]
[null,null,null,null,null,null,null,null,null,null,null,null,null,null,null,null,null,null,null,null,null,null,null,null,null,null,null,57,null,null,null,null,null,"107","鈴鹿医療","鈴鹿医療科学大学薬学部（H26.3卒～）","ｽｽﾞｶｲﾘｮｳｶｶﾞｸﾀﾞｲｶﾞｸﾔｸｶﾞｸﾌﾞ"]
[null,null,null,null,null,null,null,null,null,null,null,null,null,null,null,null,null,null,null,null,null,null,null,null,null,null,null,58,null,null,null,null,null,"073","摂南大","摂南大学薬学部","ｾﾂﾅﾝﾀﾞｲｶﾞｸﾔｸｶﾞｸﾌﾞ"]
[null,null,null,null,null,null,null,null,null,null,null,null,null,null,null,null,null,null,null,null,null,null,null,null,null,null,null,59,null,null,null,null,null,"095","崇城大","崇城大学薬学部（H21.3卒～）","ｿｳｼﾞｮｳﾀﾞｲｶﾞｸﾔｸｶﾞｸﾌﾞ"]
[null,null,null,null,null,null,null,null,null,null,null,null,null,null,null,null,null,null,null,null,null,null,null,null,null,null,null,60,null,null,null,null,null,"064","第一薬大","第一薬科大学","ﾀﾞｲﾁﾔｯｶﾀﾞｲｶﾞｸ"]
[null,null,null,null,null,null,null,null,null,null,null,null,null,null,null,null,null,null,null,null,null,null,null,null,null,null,null,61,null,null,null,null,null,"096","高崎健康","高崎健康福祉大学薬学部（H24.3卒～）","ﾀｶｻｷｹﾝｺｳﾌｸsﾀﾞｲｶﾞｸﾔｸｶﾞｸﾌﾞ"]
[null,null,null,null,null,null,null,null,null,null,null,null,null,null,null,null,null,null,null,null,null,null,null,null,null,null,null,62,null,null,null,null,null,"007","千葉薬専","千葉医大附属薬学専門部","ﾁﾊﾞｲﾀﾞｲﾌｿﾞｸﾔｸｶﾞｸｾﾝﾓﾝﾌﾞ"]
[null,null,null,null,null,null,null,null,null,null,null,null,null,null,null,null,null,null,null,null,null,null,null,null,null,null,null,63,null,null,null,null,null,"083","千葉科学","千葉科学大学薬学部（H20.3卒～）","ﾁﾊﾞｶｶﾞｸﾀﾞｲｶﾞｸﾔｸｶﾞｸﾌﾞ"]
[null,null,null,null,null,null,null,null,null,null,null,null,null,null,null,null,null,null,null,null,null,null,null,null,null,null,null,64,null,null,null,null,null,"008","千葉大","千葉大学薬学部","ﾁﾊﾞﾀﾞｲｶﾞｸﾔｸｶﾞｸﾌﾞ"]
[null,null,null,null,null,null,null,null,null,null,null,null,null,null,null,null,null,null,null,null,null,null,null,null,null,null,null,65,null,null,null,null,null,"031","帝京大","帝京大学薬学部","ﾃｲｷｮｳﾀﾞｲｶﾞｸﾔｸｶﾞｸﾌﾞ"]
[null,null,null,null,null,null,null,null,null,null,null,null,null,null,null,null,null,null,null,null,null,null,null,null,null,null,null,66,null,null,null,null,null,"085","帝京平成","帝京平成大学薬学部（H20.3卒～）","ﾃｲｷｮｳﾍｲｾｲﾀﾞｲｶﾞｸﾔｸｶﾞｸﾌﾞ"]
[null,null,null,null,null,null,null,null,null,null,null,null,null,null,null,null,null,null,null,null,null,null,null,null,null,null,null,67,null,null,null,null,null,"050","帝国女専","帝国女子薬学専門学校","ﾃｲｺｸｼﾞｮｼﾔｸｶﾞｸｾﾝﾓﾝｶﾞｯｺｳ"]
[null,null,null,null,null,null,null,null,null,null,null,null,null,null,null,null,null,null,null,null,null,null,null,null,null,null,null,68,null,null,null,null,null,"017","東女薬専","東京女子薬学専門学校","ﾄｳｷｮｳｼﾞｮｼﾔｸｶﾞｸｾﾝﾓﾝｶﾞｯｺｳ"]
[null,null,null,null,null,null,null,null,null,null,null,null,null,null,null,null,null,null,null,null,null,null,null,null,null,null,null,69,null,null,null,null,null,"011","東　大","東京大学医学部薬学科","ﾄｳｷｮｳﾀﾞｲｶﾞｸｲｶﾞｸﾌﾞﾔｸｶﾞｸｶ"]
[null,null,null,null,null,null,null,null,null,null,null,null,null,null,null,null,null,null,null,null,null,null,null,null,null,null,null,70,null,null,null,null,null,"011","東　大","東京大学薬学部","ﾄｳｷｮｳﾀﾞｲｶﾞｸﾔｸｶﾞｸﾌﾞ"]
[null,null,null,null,null,null,null,null,null,null,null,null,null,null,null,null,null,null,null,null,null,null,null,null,null,null,null,71,null,null,null,null,null,"012","東京薬専","東京薬学専門学校","ﾄｳｷｮｳﾔｸｶﾞｸｾﾝﾓﾝｶﾞｯｺｳ"]
[null,null,null,null,null,null,null,null,null,null,null,null,null,null,null,null,null,null,null,null,null,null,null,null,null,null,null,72,null,null,null,null,null,"014","東薬女専","東京薬学専門学校女子部","ﾄｳｷｮｳﾔｸｶﾞｸｾﾝﾓﾝｶﾞｯｺｳｼﾞｮｼﾌﾞ"]
[null,null,null,null,null,null,null,null,null,null,null,null,null,null,null,null,null,null,null,null,null,null,null,null,null,null,null,73,null,null,null,null,null,"013","東薬大","東京薬科大学","ﾄｳｷｮｳﾔｯｶﾀﾞｲｶﾞｸ"]
[null,null,null,null,null,null,null,null,null,null,null,null,null,null,null,null,null,null,null,null,null,null,null,null,null,null,null,74,null,null,null,null,null,"016","理科大","東京理科大学薬学部","ﾄｳｷｮｳﾘｶﾀﾞｲｶﾞｸﾔｸｶﾞｸﾌﾞ"]
[null,null,null,null,null,null,null,null,null,null,null,null,null,null,null,null,null,null,null,null,null,null,null,null,null,null,null,75,null,null,null,null,null,"094","同志社女","同志社女子大学薬学部（H21.3卒～）","ﾄﾞｳｼｼｬｼﾞｮｼﾀﾞｲｶﾞｸﾔｸｶﾞｸﾌﾞ"]
[null,null,null,null,null,null,null,null,null,null,null,null,null,null,null,null,null,null,null,null,null,null,null,null,null,null,null,76,null,null,null,null,null,"009","東邦薬専","東邦（帝国）女子医学薬学専門学校","ﾄｳﾎｳ(ﾃｲｺｸ)ｼﾞｮｼｲｶﾞｸﾔｸｶﾞｸｾﾝﾓﾝｶﾞｯｺｳ"]
[null,null,null,null,null,null,null,null,null,null,null,null,null,null,null,null,null,null,null,null,null,null,null,null,null,null,null,77,null,null,null,null,null,"010","東邦大","東邦大学薬学部","ﾄｳﾎｳﾀﾞｲｶﾞｸﾔｸｶﾞｸﾌﾞ"]
[null,null,null,null,null,null,null,null,null,null,null,null,null,null,null,null,null,null,null,null,null,null,null,null,null,null,null,78,null,null,null,null,null,"109","東北医薬","東北医科薬科大学薬学部（H29.3卒～）","ﾄｳﾎｸｲｶﾔｯｶﾀﾞｲｶﾞｸﾔｸｶﾞｸﾌﾞ"]
[null,null,null,null,null,null,null,null,null,null,null,null,null,null,null,null,null,null,null,null,null,null,null,null,null,null,null,79,null,null,null,null,null,"006","東北大","東北大学薬学部（医学部薬学科）","ﾄｳﾎｸﾀﾞｲｶﾞｸﾔｸｶﾞｸﾌﾞ"]
{"$rows_left_out":44}